{"text_format":"1","workbook":"xlsx","n_sheets":9,"sheets":["Introduction","How to Complete the Forms","800-66 Risk Guidance","Practice Summary","Inventory (Preparation)","Screening Questions (Step 1)","People and Processes  (Step 2a)","Technology (Step 2b)","Findings-Remediation (Step 3)"],"not_rendered":{"charts":0,"images":2,"macros":1,"external_links":0,"defined_names":24,"comments":1,"pivot_tables":0},"unopened":[],"bounds":{"document_bytes":16777216,"sheet_cells":100000,"rows_first":2000,"rows_last":500,"rows_between":2000,"halvings":0,"cell_chars":16384,"cell_head_chars":4096},"cells_cut":0,"cells_raw":0,"read":"whole","date_system":"1900"}

{"sheet":"Introduction","index":0,"n_rows":22,"n_cols":2,"rows_kept":22,"cut":false,"hidden":false,"merged":[]}
[]
[]
["HIT Security Risk Assessment Tool"]
["Presented By:","The National Learning Consortium (NLC)"]
["Developed By:","Health Information Technology Research Center (HITRC)                                                                                  "]
[null,"Privacy and Security Community of Practice (Toolkit Workgroup)"]
["Version:",1]
["Date:","2011-10-21"]
[" Description: ","The purpose of a risk assessment is to identify conditions where Electronic Protected Health Information (EPHI) could be disclosed without proper authorization, improperly modified, or made unavailable when needed. This information is then used to make risk management decisions on what reasonable and appropriate safeguards are needed to reduce risk to an acceptable level. This Risk Assessment Tool is intended to be a starting point for identifying cybersecurity risks to your organization. Please note that this tool is best printed using landscape orientation and on legal sized paper. \n"]
["Table of Contents:","How to Complete the Forms"]
[null,"800-66 Risk Guidance"]
[null,"Practice Summary"]
[null,"Inventory (Preparation)"]
[null,"Screening Questions (Step 1)"]
[null,"People and Processes  (Step 2a)"]
[null,"Technology (Step 2b)"]
[null,"Findings-Remediation (Step 3)"]
[]
[null,"The National Learning Consortium (NLC) is a virtual and evolving body of knowledge and tools designed to support healthcare providers and health IT professionals working towards the implementation, adoption and meaningful use of certified EHR systems.  \n\nThe NLC represents the collective EHR implementation experiences and knowledge gained directly from the field of ONC’s outreach programs (REC, Beacon, State HIE) and through the Health Information Technology Research Center (HITRC) Communities of Practice (CoPs).\n\nThe following resource is a tool used in the field today and recommended by “boots-on-the-ground” professionals for use by others who have made the commitment to implement or upgrade to certified EHR systems. \n"]
[]
["Table of Contents"]
["Vendor Eval Matrix Ratings"]

{"sheet":"How to Complete the Forms","index":1,"n_rows":0,"n_cols":0,"rows_kept":0,"cut":false,"hidden":false,"merged":[]}

{"sheet":"800-66 Risk Guidance","index":2,"n_rows":0,"n_cols":0,"rows_kept":0,"cut":false,"hidden":false,"merged":[]}

{"sheet":"Practice Summary","index":3,"n_rows":46,"n_cols":2,"rows_kept":46,"cut":false,"hidden":false,"merged":[[45,1,1048575,1]]}
[]
[null,"Practice Summary"]
["Last Revision Date"]
["Contributors\n(persons involved with the assessment)"]
[]
["Practice Information"]
["Practice Name"]
["Contact Information\n(Practice Point of Contact)","Name:\nEmail:\nPhone:"]
["Office Locations"]
[]
["EHR Information"]
["EHR Model\n(Hosted or Client/Server)"]
["EHR System"]
["Certified Version?"]
[]
["Vendors/Third Parties"]
["IT Vendor"]
["EHR Vendor Company"]
["REC"]
["Other"]
[]
["Infrastructure"]
["EHR Server Information"]
["Fax Server Information"]
["Network Firewall"]
["Wireless Devices"]
["Workstations"]
["Laptops"]
["Scanners"]
["Fax Machines"]
{"$rows_left_out":17}
{"sheet":"Inventory (Preparation)","index":4,"n_rows":21,"n_cols":3,"rows_kept":21,"cut":false,"hidden":false,"merged":[]}
[]
[null,"Inventory Assets (Preparation)"]
[]
[]
[]
[]
[]
[]
[]
[]
[]
[]
[]
[]
[]
[]
[]
[]
[]
[]
["Asset Type","Does this asset process, store or transmit EPHI?","People/Process or Technology Asset?"]

{"sheet":"Screening Questions (Step 1)","index":5,"n_rows":50,"n_cols":7,"rows_kept":50,"cut":false,"hidden":false,"merged":[[21,0,21,6],[1,0,1,6],[12,0,12,1],[13,0,13,6],[16,0,16,6],[18,0,18,6],[48,0,48,6],[23,0,23,6],[27,0,27,6],[29,0,29,6],[34,0,34,6],[38,0,38,6],[46,0,46,6]]}
["National Learning Consortium logo - Advancing America's Health Care","Select text object to read instructions then proceed to A14 to view and complete form"]
["Screening Questions (Step 1)"]
[]
[]
[]
[]
[]
[]
[]
[]
[]
[]
["Topic",null,"Question","Response","Threat Vulnerability Statement","People/ Processes","Technology"]
["1.  Security Program"]
[1.1000000000000001,"Roles & Responsibilities","[1.1] Has your organization formally appointed a central point of contact for security coordination?\na)    If so, whom, and what is their position within the organization?\nb) Responsibilities clearly documented? i.e. job descriptions, information security policy",null,"Management has not defined responsibilities for the information security program. [TVS001]",null,"N/A"]
[1.2,"External Parties","[1.2] Do you work with third parties, such as IT service providers, that have access to your patient's information? \na)    Does your organization have Business Associate agreements in place with these third parties? i.e. REC, IT Vendor, EHR Vendor, etc.\nb)    If not, what controls does your organization have in place to monitor and assess third parties? i.e. Logging of VPN connections, EHR logs, etc.",null,"Security breaches occur when dealing with third parties due to a lack of security considerations in the related third party agreement. [TVS002]"]
["2.  Security Policy"]
[2.1,"Information Security Policy & Procedures","[2.1] Do you have documented information security policies and procedures?\na)     Do you have a formal information classification procedure? Please describe it.  In particular, how would patient data be categorized?  For example, critical, essential, and normal.\nb)    Have formal acceptable use rules been established for assets? Example assets include data assets, computer equipment, communications equipment, etc.\nDo you have formal processes in place for security policy maintenance and deviation? ",null,"Management does not set a clear policy direction in line with business objectives and demonstrate support for, and commitment to, information security. [TVS003]",null,"N/A"]
["3.  Risk Management & Compliance"]
[3.1,"Risk Assessment","[3.1] Do you have a process that addresses: the identification and measurement of potential risks, mitigating controls (measures taken to reduce risk), and the acceptance or transfer (Insurance policies, warranties for example) of the remaining (residual) risk after mitigation steps have been applied? ",null,"Information around risks and related control options are not presented to management before management decisions are made. [TVS004]"," - REC helping to start the risk assessment process by using this spreadsheet as a foundation for the risk assessment as well as risk management plan.\n - No prior risk assessments conducted"," - No regular assessments of technology is performed; including vulnerability testing, patch management, or other review of systems to help determine risks associated with them so appropriate action(s) can be taken."]
[3.2,"Compliance with Legal Requirements - Identification of applicable legislation","[3.2] Does a process exist to identify new laws and regulations with IT security implications? (e.g., new state breach notification requirements)?\n i.e. Newsletters, Webinars, etc. ",null,"Legislative, statutory, regulatory or contractual obligations related to security are violated due to lack of controls. [TVS005]"," - Working with the REC helps to identify new laws and regulations due to the training and guidance with the REC team\n - State breach guidance also available through the REC within the privacy and security toolkit","N/A"]
["4.  Training & Awareness"]
[4.0999999999999996,"During Employment – Training, Education & Awareness","[4.1] Have your employees been provided formal information security training? Have policies been communicated to your employees?   Are periodic security reminders provided?\n i.e. New employee orientation, yearly training, posters in public areas, email reminders, etc.",null,"Applications and technology solutions are not correctly and securely used since a training curriculum for employees has not been established or regularly updated. [TVS006]"," - No formal information security training but periodic HIPAA training (random). \n - No one dedicated to the role of training. \n - No IT orientation"," - The use of technology regarding a training curriculum is not currently being utilized."]
["5.  Personnel Security"]
[5.0999999999999996,"Background Checks","[5.1] Does your organization perform background checks to examine and assess an employee’s or contractor’s work and criminal history? \n i.e. Credential verification, criminal history, references",null,"Background verification checks are not carried out and management is not aware of academic, professional, credit or criminal backgrounds of employees. [TVS007]"," - References are verified\n - Credential verification is also performed\n - No criminal background checks are performed at this time","N/A"]
[5.2,"Prior to Employment - Terms and Conditions of Employment","[5.2] Are your employees required to sign a non-disclosure agreement? If so, are employees required to sign the non-disclosure agreement annually? Non-disclosure and/or confidentiality form at initial employment",null,"Employees or contractors do not agree or sign terms or conditions of employment. [TVS008]"," - Non disclosure Agreements required prior to employment"," - Accounts are not created within the EHR until appropriate Agreements are signed"]
[5.3,"Termination or Change in Employment","[5.3] Do you have a formal process to manage the termination and or transfer of employees? \n i.e. All equipment is returned, user ID's disabled in EHR and Windows, badges and/or keys returned.",null,"Employee, contractor or third party user terminations or change of responsibilities could result in a security breach due to lack of a defined management process for terminations or changes in responsibilities. [TVS009]"," - No known procedures in place for terminations or changes of responsibilities.\n - Disabling of access within the EHR as well as retrieval of keys and equipment is performed."," - User accounts are disabled within the EHR"]
["6.  Physical Security"]
[6.1,"Secure Areas","[6.1] Do you have effective physical access controls (e.g., door locks) in place that prevent unauthorized access to facilities and a facility security plan? \na)     Are there plans in place to handle/manage contingent events or circumstances (e.g. what if the person with the key to the server room is sick)?  \nb)     Is there a facility security plan?  \nc)     How are physical access controls authorized (who is responsible for ensuring that only appropriate persons have keys or codes to the facility and to locations within the facility with ePHI)? \nd)    Are there policies and procedures to document repairs and modifications to physical components of the facility that are related to security?\n - [See Facility Walkthrough Checklist for additional information]\n",null,"Unauthorized parties gain physical access to facilities due to insufficient physical entry/exit controls. [TVS010]"," - No facility security plan is currently in place at the practice\n - Fire escape plans are posted throughout the building\n - Alarm system is currently in place and monitored 24/7\n\n - Front Desk\nWaiting room securely separated?\nAll patients must sign in?\nAll visitors must sign in?\nAll visitors & patients escorted?\nSign-in sheet secured and maintained?"," - Workstations/Laptops/Tablets\nPositioning?\nPrivacy screens used?\nCable locks used?\n\n - Server Room\nServer room location?\nLocked at all times?\nProper cooling?\nBattery backup?\nFire suppression?\n\n - Network Closet\nLocked at all times?\nProper cooling?\nBattery backup?\n\n - Building\nEmergency lighting?\nFire detection?\nFire suppression?\nBack door remains locked?\nOther doors remain locked? \nWater shut-off valves?\nEmergency power shut-off?\nBuilding alarm system?"]
["7.  Network Security"]
{"$rows_left_out":21}
{"sheet":"People and Processes  (Step 2a)","index":6,"n_rows":87,"n_cols":12,"rows_kept":87,"cut":false,"hidden":false,"merged":[[1,0,1,11],[54,1,54,2],[54,3,54,4],[54,6,54,11]]}
[]
["People and Processes (Step 2a)"]
[]
[]
[]
[]
[]
[]
[]
[]
[]
[]
[]
[]
[]
[]
[]
[]
[]
[]
[]
[]
[]
[]
[]
[]
[]
[]
[]
[]
{"$rows_left_out":58}
{"sheet":"Technology (Step 2b)","index":7,"n_rows":59,"n_cols":12,"rows_kept":59,"cut":false,"hidden":false,"merged":[[1,0,1,11],[32,1,32,2],[32,3,32,4],[32,6,32,11]]}
[]
["Technology (Step 2b)"]
[]
[]
[]
[]
[]
[]
[]
[]
[]
[]
[]
[]
[]
[]
[]
[]
[]
[]
[]
[]
[]
[]
[]
[]
[]
[]
[]
[]
{"$rows_left_out":30}
{"sheet":"Findings-Remediation (Step 3)","index":8,"n_rows":96,"n_cols":7,"rows_kept":96,"cut":false,"hidden":false,"merged":[[1,0,1,6],[21,0,21,6],[60,0,60,6]]}
[]
["Findings-Remediation (Step 3)"]
[]
[]
[]
[]
[]
[]
[]
[]
[]
[]
[]
[]
[]
[]
[]
[]
["Number of High Risks",8,"`"]
["Number of Medium Risks",8]
["Total Number of High and Medium Risks",{"$f":"SUM(B19:B20)","v":16}]
["High and Medium Risks Findings and Remediation "]
["Risks Found \n(High and Medium Only) ","Risk Rating ","Existing Control Measures Applied","Recommended Control Measures ","Owner","Remediation Steps","Target Date"]
["People and Processes"]
[{"$f":"IF(OR('People and Processes  (Step 2a)'!$L57=\"Medium\",'People and Processes  (Step 2a)'!$L57=\"High\"),'People and Processes  (Step 2a)'!$B57,\"\")","v":""},{"$f":"IF(OR('People and Processes  (Step 2a)'!$L57=\"Medium\",'People and Processes  (Step 2a)'!$L57=\"High\"),'People and Processes  (Step 2a)'!$L57,\"\")","v":""},{"$f":"IF(OR('People and Processes  (Step 2a)'!$L57=\"Medium\",'People and Processes  (Step 2a)'!$L57=\"High\"),IF(ISBLANK('People and Processes  (Step 2a)'!$D57), \"\", 'People and Processes  (Step 2a)'!$D57),\"\")","v":""},{"$f":"IF(OR('People and Processes  (Step 2a)'!$L57=\"Medium\",'People and Processes  (Step 2a)'!$L57=\"High\"),'People and Processes  (Step 2a)'!$C57,\"\")","v":""}]
[{"$f":"IF(OR('People and Processes  (Step 2a)'!$L58=\"Medium\",'People and Processes  (Step 2a)'!$L58=\"High\"),'People and Processes  (Step 2a)'!$B58,\"\")","v":""},{"$f":"IF(OR('People and Processes  (Step 2a)'!$L58=\"Medium\",'People and Processes  (Step 2a)'!$L58=\"High\"),'People and Processes  (Step 2a)'!$L58,\"\")","v":""},{"$f":"IF(OR('People and Processes  (Step 2a)'!$L58=\"Medium\",'People and Processes  (Step 2a)'!$L58=\"High\"),IF(ISBLANK('People and Processes  (Step 2a)'!$D58), \"\", 'People and Processes  (Step 2a)'!$D58),\"\")","v":""},{"$f":"IF(OR('People and Processes  (Step 2a)'!$L58=\"Medium\",'People and Processes  (Step 2a)'!$L58=\"High\"),'People and Processes  (Step 2a)'!$C58,\"\")","v":""}]
[{"$f":"IF(OR('People and Processes  (Step 2a)'!$L59=\"Medium\",'People and Processes  (Step 2a)'!$L59=\"High\"),'People and Processes  (Step 2a)'!$B59,\"\")","v":""},{"$f":"IF(OR('People and Processes  (Step 2a)'!$L59=\"Medium\",'People and Processes  (Step 2a)'!$L59=\"High\"),'People and Processes  (Step 2a)'!$L59,\"\")","v":""},{"$f":"IF(OR('People and Processes  (Step 2a)'!$L59=\"Medium\",'People and Processes  (Step 2a)'!$L59=\"High\"),IF(ISBLANK('People and Processes  (Step 2a)'!$D59), \"\", 'People and Processes  (Step 2a)'!$D59),\"\")","v":""},{"$f":"IF(OR('People and Processes  (Step 2a)'!$L59=\"Medium\",'People and Processes  (Step 2a)'!$L59=\"High\"),'People and Processes  (Step 2a)'!$C59,\"\")","v":""}]
[{"$f":"IF(OR('People and Processes  (Step 2a)'!$L60=\"Medium\",'People and Processes  (Step 2a)'!$L60=\"High\"),'People and Processes  (Step 2a)'!$B60,\"\")","v":"Information around risks and related control options are not presented to management before management decisions are made. [TVS004]"},{"$f":"IF(OR('People and Processes  (Step 2a)'!$L60=\"Medium\",'People and Processes  (Step 2a)'!$L60=\"High\"),'People and Processes  (Step 2a)'!$L60,\"\")","v":"Medium"},{"$f":"IF(OR('People and Processes  (Step 2a)'!$L60=\"Medium\",'People and Processes  (Step 2a)'!$L60=\"High\"),IF(ISBLANK('People and Processes  (Step 2a)'!$D60), \"\", 'People and Processes  (Step 2a)'!$D60),\"\")","v":" - REC helping to start the risk assessment process by using this spreadsheet as a foundation for the risk assessment as well as risk management plan.\n - No prior risk assessments conducted"},{"$f":"IF(OR('People and Processes  (Step 2a)'!$L60=\"Medium\",'People and Processes  (Step 2a)'!$L60=\"High\"),'People and Processes  (Step 2a)'!$C60,\"\")","v":"Risk assessments are conducted to identify, quantify, prioritize and manage risks.  The prioritization is accomplished by creating and using criteria for risk acceptance and objectives which are important to the organization. [RCM004]\n - Ensure this risk assessment is accurate with all information that has been filled out as well as the risk ratings (likelihood and impact) that have also been completed based on the  information provided.\n - After verifying the accuracy of information, the Medium and High risk items from the Findings-Remediation tab should be addressed by making the necessary business decisions on whether to mitigate, transfer, or accept the risks. It is recommended to mitigate risks that are easy to address.\n - It is important to continue the risk assessment process by assessing additional risks to your facility, systems, and all other assets to ensure a thorough and up-to-date risk assessment is conducted."}]
[{"$f":"IF(OR('People and Processes  (Step 2a)'!$L61=\"Medium\",'People and Processes  (Step 2a)'!$L61=\"High\"),'People and Processes  (Step 2a)'!$B61,\"\")","v":""},{"$f":"IF(OR('People and Processes  (Step 2a)'!$L61=\"Medium\",'People and Processes  (Step 2a)'!$L61=\"High\"),'People and Processes  (Step 2a)'!$L61,\"\")","v":""},{"$f":"IF(OR('People and Processes  (Step 2a)'!$L61=\"Medium\",'People and Processes  (Step 2a)'!$L61=\"High\"),IF(ISBLANK('People and Processes  (Step 2a)'!$D61), \"\", 'People and Processes  (Step 2a)'!$D61),\"\")","v":""},{"$f":"IF(OR('People and Processes  (Step 2a)'!$L61=\"Medium\",'People and Processes  (Step 2a)'!$L61=\"High\"),'People and Processes  (Step 2a)'!$C61,\"\")","v":""}]
[{"$f":"IF(OR('People and Processes  (Step 2a)'!$L62=\"Medium\",'People and Processes  (Step 2a)'!$L62=\"High\"),'People and Processes  (Step 2a)'!$B62,\"\")","v":""},{"$f":"IF(OR('People and Processes  (Step 2a)'!$L62=\"Medium\",'People and Processes  (Step 2a)'!$L62=\"High\"),'People and Processes  (Step 2a)'!$L62,\"\")","v":""},{"$f":"IF(OR('People and Processes  (Step 2a)'!$L62=\"Medium\",'People and Processes  (Step 2a)'!$L62=\"High\"),IF(ISBLANK('People and Processes  (Step 2a)'!$D62), \"\", 'People and Processes  (Step 2a)'!$D62),\"\")","v":""},{"$f":"IF(OR('People and Processes  (Step 2a)'!$L62=\"Medium\",'People and Processes  (Step 2a)'!$L62=\"High\"),'People and Processes  (Step 2a)'!$C62,\"\")","v":""}]
{"$rows_left_out":66}